Updated to php-malware-finder-0.3.2

1 job for master in 9 minutes and 30 seconds (queued for 2 seconds)
latest
Status Job ID Name Coverage
  Build
failed #2991
docker
build

00:09:30

 
Name Stage Failure
failed
build Build There is an unknown failure, please try again
Step 21 : RUN make tests
---> Running in 8d2095e0ccd2
./whitelists/custom.yar(12): error: syntax error, unexpected _IDENTIFIER_
./whitelists/custom.yar(16): error: unterminated regular expression
[-] 0x294d:$eval: {eval( was not detected in cpanel.php, sorry
Makefile:5: recipe for target 'tests' failed
make: *** [tests] Error 1
The command '/bin/sh -c make tests' returned a non-zero code: 2
ERROR: Build failed: exit code 1